{"text_format":"1","workbook":"xlsx","n_sheets":6,"sheets":["K3VL-Mobile","M spec","K3VL-Industrial J","I spec","translation","history"],"not_rendered":{"charts":0,"images":5,"macros":1,"external_links":0,"defined_names":105,"comments":0,"pivot_tables":0},"unopened":[],"bounds":{"document_bytes":16777216,"sheet_cells":100000,"rows_first":2000,"rows_last":500,"rows_between":2000,"halvings":0,"cell_chars":16384,"cell_head_chars":4096},"cells_cut":0,"cells_raw":0,"read":"whole","date_system":"1900"}

{"sheet":"K3VL-Mobile","index":0,"n_rows":73,"n_cols":51,"rows_kept":73,"cut":false,"hidden":false,"merged":[[30,22,31,22],[32,7,33,12],[30,7,31,12],[32,13,33,18],[34,19,35,19],[34,21,35,21],[34,20,35,20],[34,22,35,22],[34,23,35,23],[26,1,28,5],[26,6,28,6],[26,19,28,19],[26,21,28,21],[26,20,28,20],[26,22,28,22],[26,23,28,23],[26,24,28,24],[27,7,27,18],[28,7,28,18],[49,1,76,12],[49,13,76,24],[36,7,36,12],[39,7,39,18],[41,7,41,18],[40,7,40,18],[42,7,42,18],[40,1,40,5],[39,1,39,5],[43,1,43,5],[43,7,43,18],[40,19,40,24],[43,23,43,24],[44,23,44,24],[37,13,37,18],[38,13,38,18],[44,7,44,18],[38,19,38,21],[41,19,41,24],[42,19,42,24],[54,27,57,31],[12,22,13,24],[12,20,13,21],[42,1,42,5],[29,1,29,5],[30,1,31,5],[32,1,33,5],[32,19,33,19],[36,1,36,5],[37,1,37,5],[41,1,41,5],[29,13,29,18],[13,9,14,9],[13,10,14,10],[13,7,14,7],[13,11,14,11],[13,12,14,12],[16,7,16,18],[13,13,14,13],[48,1,48,12],[48,13,48,24],[13,16,14,16],[12,1,14,2],[13,5,14,5],[69,46,72,50],[20,46,20,50],[24,49,24,50],[25,49,25,50],[26,49,26,50],[27,49,27,50],[28,49,28,50],[29,49,29,50],[22,47,22,48],[22,49,22,50],[21,47,21,48],[21,49,21,50],[59,46,59,47],[60,46,60,50],[61,48,61,49],[62,48,62,49],[63,48,63,49],[64,48,64,49],[58,46,58,50],[34,24,35,24],[38,22,38,23],[59,48,59,49],[65,46,68,50],[26,47,26,48],[61,46,61,47],[62,46,62,47],[63,46,63,47],[64,46,64,47],[58,32,68,32],[30,45,32,45],[58,45,68,45],[33,45,45,45],[30,32,32,32],[54,45,57,45],[51,45,53,45],[54,32,57,32],[30,33,30,38],[30,39,30,44],[46,46,50,50],[51,46,53,50],[54,46,57,50],[46,32,50,32],[18,27,19,31],[19,20,24,24],[17,20,18,24],[17,19,24,19],[33,27,45,31],[30,27,32,31],[32,20,33,20],[30,20,31,20],[38,1,38,5],[30,19,31,19],[30,13,31,18],[34,1,35,5],[44,1,44,5],[45,1,45,5],[34,7,35,12],[34,13,35,18],[38,7,38,12],[37,7,37,12],[36,13,36,18],[26,13,26,18],[25,7,25,18],[26,7,26,12],[29,7,29,12],[45,7,45,18],[1,46,1,50],[2,46,2,50],[3,46,5,50],[6,46,6,50],[7,46,17,50],[18,46,19,50],[30,46,32,50],[33,46,45,50],[1,33,1,44],[27,47,27,48],[28,47,28,48],[24,47,24,48],[23,46,23,50],[7,45,17,45],[18,32,19,32],[29,47,29,48],[25,47,25,48],[46,45,50,45],[51,32,53,32],[33,39,33,44],[33,33,33,38],[33,32,45,32],[16,1,16,5],[16,20,16,24],[17,1,24,5],[17,6,24,6],[25,1,25,5],[18,8,18,10],[19,8,19,10],[20,8,20,10],[21,8,21,10],[22,8,22,10],[23,8,23,10],[17,11,17,12],[17,13,17,14],[17,15,17,16],[17,17,17,18],[24,8,24,10],[11,1,11,9],[17,8,17,10],[13,8,14,8],[13,3,14,3],[13,4,14,4],[2,27,2,31],[3,27,5,31],[13,17,14,17],[13,18,14,18],[3,1,4,10],[3,11,4,13],[6,11,7,13],[9,11,10,13],[3,14,4,17],[6,14,7,17],[9,14,10,17],[6,18,7,20],[9,18,10,20],[5,1,7,10],[8,1,10,10],[1,6,2,9],[13,6,14,6],[13,14,14,14],[13,15,14,15],[69,45,72,45],[69,27,72,31],[69,32,72,32],[6,27,6,31],[1,21,1,23],[25,20,25,23],[1,27,1,31],[51,27,53,31],[3,32,5,32],[3,45,5,45],[39,19,39,24],[7,32,17,32],[18,45,19,45],[7,27,17,31],[20,27,29,31],[20,32,29,32],[20,45,29,45],[32,22,33,22],[58,27,68,31],[46,27,50,31],[3,21,4,24],[6,21,7,24],[9,21,10,24],[3,18,4,20]]}
[]
[null,null,null,null,null,null,{"$f":"IF(AND(U26<>\"\",U27<>\"\",U30<>\"\",U31<>\"\",U33<>\"\",U37<>\"\",X37<>\"\",X27<>\"\",X30<>\"\",X31<>\"\",X32<>\"\",X33<>\"\",X34<>\"\",T41<>\"\",X43<>\"\",X44<>\"\",U43<>\"\",U44<>\"\"),\"\",translation!E16)","v":"All required fields are not filled in."},null,null,null,null,null,null,null,null,null,null,null,null,null,null,"Language : English",null,null,"Rev: 1",null,null,{"$f":"translation!E90","v":"Items"},null,null,null,null,{"$f":"translation!E91","v":"No."},{"$f":"translation!E92","v":"Standard Specifications"},null,null,null,null,null,null,null,null,null,null,null,{"$f":"translation!E93","v":"Code"},{"$f":"translation!E94","v":"Note"}]
[null,null,null,null,null,null,null,null,null,null,null,null,null,null,null,null,null,null,null,null,null,null,null,null,null,null,null,{"$f":"translation!E96","v":"Design Series"},null,null,null,null,3,{"$f":"IF(T18=28,\"/C \",\"/B \")","v":"/B "},null,null,null,null,null,null,null,null,null,null,{"$f":"IF('M spec'!K55=\"★\",\"★\",IF('M spec'!K55=\"▲\",\"▲\",IF('M spec'!K55=\"◆\",\"◆\",\"\")))","v":""},{"$f":"IF(T18=28,\"/C\",\"/B\")","v":"/B"}]
[null,{"$f":"translation!E3","v":"K3VL series for Mobiles Inquiry Form"},null,null,null,null,null,null,null,null,null,{"$f":"translation!E8","v":"Fill-in Date ："},null,null,null,null,null,null,{"$f":"translation!E9","v":"Author ："},null,null,null,null,null,null,null,null,{"$f":"translation!E97","v":"Hydraulic Fluid Type"},null,null,null,null,4,"- ",{"$f":"translation!E115","v":" Mineral Oil (Orings: Nitrile rubber, Shaft Seal: Fluoro rubber)"},null,null,null,null,null,null,null,null,null,{"$f":"IF('M spec'!K56=\"★\",\"★\",IF('M spec'!K56=\"▲\",\"▲\",IF('M spec'!K56=\"◆\",\"◆\",\"\")))","v":""},"-"]
[null,null,null,null,null,null,null,null,null,null,null,null,null,null,null,null,null,null,null,null,null,null,null,null,null,null,null,null,null,null,null,null,null,"V ",{"$f":"translation!E116","v":" Viton Seal Throughout (Orings: Fluoro rubber, Shaft Seal: Fluoro rubber)"},null,null,null,null,null,null,null,null,null,{"$f":"IF('M spec'!K57=\"★\",\"★\",IF('M spec'!K57=\"▲\",\"▲\",IF('M spec'!K57=\"◆\",\"◆\",\"\")))","v":""}]
[null,{"$f":"translation!E5","v":"Please select an item from a drop down list in a cell with thick red borders. Options with ★ is that please contact Kawasaki, options with ◆ is available in Europe/US."},null,null,null,null,null,null,null,null,null,null,null,null,null,null,null,null,null,null,null,null,null,null,null,null,null,null,null,null,null,null,null,"W ",{"$f":"translation!E117","v":" Water Glycol (Orings: Nitrile rubber, Shaft Seal: Nitrile rubber)"},null,null,null,null,null,null,null,null,null,{"$f":"IF('M spec'!K58=\"★\",\"★\",IF('M spec'!K58=\"▲\",\"▲\",IF('M spec'!K58=\"◆\",\"◆\",\"\")))","v":""}]
[null,null,null,null,null,null,null,null,null,null,null,{"$f":"translation!E10","v":"Application ："},null,null,null,null,null,null,{"$f":"translation!E11","v":"Machine M/C ："},null,null,null,null,null,null,null,null,{"$f":"translation!E98","v":"Series Type Code"},null,null,null,null,5,"1 ",{"$f":"translation!E118","v":" Standard Type"},null,null,null,null,null,null,null,null,null,{"$f":"IF('M spec'!K59=\"★\",\"★\",IF('M spec'!K59=\"▲\",\"▲\",IF('M spec'!K59=\"◆\",\"◆\",\"\")))","v":""},{"$f":"'M spec'!B59","v":1}]
[null,null,null,null,null,null,null,null,null,null,null,null,null,null,null,null,null,null,null,null,null,null,null,null,null,null,null,{"$f":"translation!E99","v":"Through Drive and Porting"},null,null,null,null,6," 0 ",{"$f":"translation!E119","v":" w/o Through Drive, Side Ported (Only Clockwise)"},null,null,null,null,null,null,null,null,null,{"$f":"IF('M spec'!K60=\"★\",\"★\",IF('M spec'!K60=\"▲\",\"▲\",IF('M spec'!K60=\"◆\",\"◆\",\"\")))","v":""},"A"]
[null,{"$f":"translation!E7","v":"If the cell's color is red, the request is out of Kawasaki standard specifications range. Even if the request is out of Kawasaki specification range, please describe the detail on the note and consult with Kawasaki."},null,null,null,null,null,null,null,null,null,null,null,null,null,null,null,null,null,null,null,null,null,null,null,null,null,null,null,null,null,null,null,"A ",{"$f":"translation!E120","v":" SAE-A 2 bolt Through Drive, Side Ported"},null,null,null,null,null,null,null,null,null,{"$f":"IF('M spec'!K61=\"★\",\"★\",IF('M spec'!K61=\"▲\",\"▲\",IF('M spec'!K61=\"◆\",\"◆\",\"\")))","v":""}]
[null,null,null,null,null,null,null,null,null,null,null,{"$f":"translation!E12","v":"Customer ："},null,null,null,null,null,null,{"$f":"translation!E13","v":"Pump Model ："},null,null,{"$f":"D14&E14&F14&G14&H14&I14&J14&K14&L14&M14&N14&O14&P14&Q14&R14&S14","v":"K3VL80/B-1ARKM-L0"},null,null,null,null,null,null,null,null,null,null,null,"B ",{"$f":"translation!E121","v":" SAE-B 2 bolt Through Drive, Side Ported"},null,null,null,null,null,null,null,null,null,{"$f":"IF('M spec'!K62=\"★\",\"★\",IF('M spec'!K62=\"▲\",\"▲\",IF('M spec'!K62=\"◆\",\"◆\",\"\")))","v":""}]
{"$rows_left_out":64}
{"sheet":"M spec","index":1,"n_rows":171,"n_cols":12,"rows_kept":171,"cut":false,"hidden":true,"merged":[[147,2,152,2],[153,2,158,2],[159,2,164,2],[165,2,170,2],[125,2,146,2]]}
[]
["2. Pump Size",null,null,28,45,80,112,140,200,"200H",{"$f":"'K3VL-Mobile'!T18","v":80}]
["Basic specifications","Pump Displacement Range",null,"28 cm3","45 - 16 cm3","80 - 35 cm3","112 - 56 cm3","140 - 70 cm3","200 - 100 cm3","200 - 100 cm3",{"$f":"HLOOKUP($K$2,TABA[],ROW(K2),FALSE)","v":"80 - 35 cm3"}]
[null,"Max",null,28,45,80,112,140,200,200,{"$f":"HLOOKUP($K$2,TABA[],ROW(K3),FALSE)","v":80}]
[null,"Min",null,28,16,35,56,70,100,100,{"$f":"HLOOKUP($K$2,TABA[],ROW(K4),FALSE)","v":35}]
[null,"Max Speed",null,3600,3250,3000,2700,2500,1900,2200,{"$f":"HLOOKUP($K$2,TABA[],ROW(K5),FALSE)","v":3000}]
[null,"Self Prime Speed",null,3000,2700,2400,2200,2200,1900,2200,{"$f":"HLOOKUP($K$2,TABA[],ROW(K6),FALSE)","v":2400}]
[null,"Peak pressure",null,35,35,35,35,35,35,35,{"$f":"HLOOKUP($K$2,TABA[],ROW(K7),FALSE)","v":35}]
[null,"Rated pressure",null,32,32,32,32,32,32,32,{"$f":"HLOOKUP($K$2,TABA[],ROW(K8),FALSE)","v":32}]
["Mount","K","SAE Key & SAE Mount","2 bolt SAE-B","2 bolt SAE-B","2 bolt SAE-C","4 bolt SAE-D","4 bolt SAE-D","4 bolt SAE-E","4 bolt SAE-E",{"$f":"HLOOKUP($K$2,TABA[],ROW(K9),FALSE)","v":"2 bolt SAE-C"}]
{"$rows_left_out":162}
{"sheet":"K3VL-Industrial J","index":2,"n_rows":48,"n_cols":51,"rows_kept":48,"cut":false,"hidden":false,"merged":[[1,6,2,9],[1,33,1,44],[1,46,1,50],[5,27,14,31],[4,27,4,31],[1,21,1,23],[1,27,1,31],[13,10,14,10],[11,1,11,9],[13,16,14,16],[13,17,14,17],[3,27,3,31],[2,27,2,31],[2,46,2,50],[3,46,3,50],[4,46,4,50],[3,1,4,10],[5,1,7,10],[8,1,10,10],[3,11,4,13],[5,46,14,50],[9,11,10,13],[3,14,4,17],[6,14,7,17],[16,1,16,5],[16,7,16,18],[16,20,16,24],[13,15,14,15],[6,11,7,13],[9,18,10,20],[6,18,7,20],[12,1,14,2],[13,3,14,3],[13,4,14,4],[13,5,14,5],[13,6,14,6],[13,7,14,7],[12,22,13,24],[12,20,13,21],[3,18,4,20],[13,8,14,8],[13,9,14,9],[13,11,14,11],[13,12,14,12],[13,13,14,13],[13,14,14,14],[9,14,10,17],[5,45,14,45],[3,21,4,24],[6,21,7,24],[9,21,10,24],[5,32,14,32],[17,1,24,5],[17,6,24,6],[38,1,38,5],[38,7,38,12],[38,19,38,21],[19,8,19,10],[24,8,24,10],[17,20,18,24],[20,46,20,50],[21,8,21,10],[17,15,17,16],[17,17,17,18],[17,19,24,19],[23,47,23,48],[23,49,23,50],[21,47,21,48],[21,49,21,50],[17,46,17,50],[22,33,22,38],[22,39,22,44],[19,20,24,24],[22,8,22,10],[24,47,24,48],[17,8,17,10],[44,1,44,5],[44,7,44,18],[47,1,47,12],[47,13,47,24],[38,22,38,23],[39,1,39,5],[39,7,39,18],[39,19,39,24],[33,27,37,31],[36,1,36,5],[36,7,36,12],[36,13,36,18],[37,1,37,5],[37,7,37,12],[34,24,35,24],[37,13,37,18],[40,1,40,5],[32,1,33,5],[32,6,33,6],[32,7,33,12],[25,1,25,5],[25,7,25,18],[25,20,25,23],[26,49,26,50],[27,46,32,50],[26,47,26,48],[32,21,33,21],[32,22,33,22],[48,13,78,24],[45,1,45,5],[45,7,45,18],[45,19,45,24],[44,23,44,24],[42,19,42,24],[40,7,40,18],[40,19,40,24],[41,1,41,5],[41,7,41,18],[41,19,41,24],[42,1,42,5],[42,7,42,18],[43,1,43,5],[43,7,43,18],[43,23,43,24],[33,45,37,45],[33,46,37,50],[34,1,35,5],[34,6,35,6],[34,7,35,12],[34,13,35,18],[34,19,35,19],[34,20,35,20],[34,21,35,21],[34,22,35,22],[34,23,35,23],[33,32,37,32],[38,45,39,45],[38,46,39,50],[45,45,46,45],[45,27,46,31],[40,27,44,31],[40,32,44,32],[45,32,46,32],[40,45,44,45],[41,46,41,47],[41,48,41,49],[40,46,40,50],[42,46,44,50],[45,46,46,50],[38,27,39,31],[38,32,39,32],[15,46,16,50],[15,45,16,45],[25,33,25,38],[25,39,25,44],[22,47,22,48],[22,49,22,50],[19,47,19,48],[19,49,19,50],[25,27,32,30],[25,32,32,32],[25,45,32,45],[22,45,24,45],[15,27,16,31],[22,27,24,31],[22,32,24,32],[15,32,16,32],[18,49,18,50],[18,47,18,48],[24,49,24,50],[25,47,25,48],[26,7,26,12],[26,13,26,18],[23,8,23,10],[25,49,25,50],[17,27,21,31],[17,32,21,32],[17,45,21,45],[17,11,17,12],[17,13,17,14],[20,8,20,10],[18,8,18,10],[30,7,31,12],[30,13,31,18],[30,19,31,19],[30,20,31,20],[29,7,29,12],[29,13,29,18],[26,1,28,5],[26,6,28,6],[32,24,33,24],[32,13,33,18],[32,19,33,19],[32,20,33,20],[30,21,31,21],[30,22,31,22],[30,24,31,24],[30,1,31,5],[30,6,31,6],[29,1,29,5],[27,7,27,18],[28,7,28,18]]}
[]
[null,null,null,null,null,null,{"$f":"IF(AND(U26<>\"\",U27<>\"\",U30<>\"\",U31<>\"\",U33<>\"\",U37<>\"\",X37<>\"\",X27<>\"\",X30<>\"\",X31<>\"\",X32<>\"\",X33<>\"\",X34<>\"\",T41<>\"\",X43<>\"\",X44<>\"\",U43<>\"\",U44<>\"\"),\"\",translation!E16)","v":"All required fields are not filled in."},null,null,null,null,null,null,null,null,null,null,null,null,null,null,{"$f":"'K3VL-Mobile'!V2","v":"Language : English"},null,null,"Rev: 1",null,null,{"$f":"translation!E90","v":"Items"},null,null,null,null,{"$f":"translation!E91","v":"No."},{"$f":"translation!E92","v":"Standard Specifications"},null,null,null,null,null,null,null,null,null,null,null,{"$f":"translation!E93","v":"Code"},{"$f":"translation!E94","v":"Note"}]
[null,null,null,null,null,null,null,null,null,null,null,null,null,null,null,null,null,null,null,null,null,null,null,null,null,null,null,{"$f":"translation!E96","v":"Design Series"},null,null,null,null,3,{"$f":"IF(T18=28,\"/C \",\"/B \")","v":"/B "},null,null,null,null,null,null,null,null,null,null,{"$f":"IF('I spec'!K45=\"★\",\"★\",IF('I spec'!K45=\"◆\",\"◆\",\"\"))","v":""},{"$f":"IF(T18=28,\"/C\",\"/B\")","v":"/B"}]
[null,{"$f":"translation!E4","v":"K3VL series for J Industrial Inquiry Form"},null,null,null,null,null,null,null,null,null,{"$f":"translation!E8","v":"Fill-in Date ："},null,null,null,null,null,null,{"$f":"translation!E9","v":"Author ："},null,null,null,null,null,null,null,null,{"$f":"translation!E97","v":"Hydraulic Fluid Type"},null,null,null,null,4,"- ",{"$f":"translation!E115","v":" Mineral Oil (Orings: Nitrile rubber, Shaft Seal: Fluoro rubber)"},null,null,null,null,null,null,null,null,null,{"$f":"IF('I spec'!K46=\"★\",\"★\",IF('I spec'!K46=\"◆\",\"◆\",\"\"))","v":""},"-"]
[null,null,null,null,null,null,null,null,null,null,null,null,null,null,null,null,null,null,null,null,null,null,null,null,null,null,null,{"$f":"translation!E98","v":"Series Type Code"},null,null,null,null,5,"1 ",{"$f":"translation!E118","v":" Standard Type"},null,null,null,null,null,null,null,null,null,{"$f":"IF('I spec'!K47=\"★\",\"★\",IF('I spec'!K47=\"◆\",\"◆\",\"\"))","v":""},{"$f":"'M spec'!B59","v":1}]
[null,{"$f":"translation!E6","v":"Please select an item from a drop down list in a cell with thick red borders. Options with ★ is that please contact Kawasaki."},null,null,null,null,null,null,null,null,null,null,null,null,null,null,null,null,null,null,null,null,null,null,null,null,null,{"$f":"translation!E99","v":"Through Drive and Porting"},null,null,null,null,6,"N ",{"$f":"translation!E128","v":" w/ Through Drive Shaft, w/o Coupling, Closed w/ Steel Cover, Side Ported"},null,null,null,null,null,null,null,null,null,{"$f":"IF('I spec'!K48=\"★\",\"★\",IF('I spec'!K48=\"◆\",\"◆\",\"\"))","v":""},"N"]
[null,null,null,null,null,null,null,null,null,null,null,{"$f":"translation!E10","v":"Application ："},null,null,null,null,null,null,{"$f":"translation!E11","v":"Machine M/C ："},null,null,null,null,null,null,null,null,null,null,null,null,null,null," 0 ",{"$f":"translation!E119","v":" w/o Through Drive, Side Ported (Only Clockwise)"},null,null,null,null,null,null,null,null,null,{"$f":"IF('I spec'!K49=\"★\",\"★\",IF('I spec'!K49=\"◆\",\"◆\",\"\"))","v":""}]
[null,null,null,null,null,null,null,null,null,null,null,null,null,null,null,null,null,null,null,null,null,null,null,null,null,null,null,null,null,null,null,null,null,"A ",{"$f":"translation!E120","v":" SAE-A 2 bolt Through Drive, Side Ported"},null,null,null,null,null,null,null,null,null,{"$f":"IF('I spec'!K50=\"★\",\"★\",IF('I spec'!K50=\"◆\",\"◆\",\"\"))","v":""}]
[null,{"$f":"translation!E7","v":"If the cell's color is red, the request is out of Kawasaki standard specifications range. Even if the request is out of Kawasaki specification range, please describe the detail on the note and consult with Kawasaki."},null,null,null,null,null,null,null,null,null,null,null,null,null,null,null,null,null,null,null,null,null,null,null,null,null,null,null,null,null,null,null,"B ",{"$f":"translation!E121","v":" SAE-B 2 bolt Through Drive, Side Ported"},null,null,null,null,null,null,null,null,null,{"$f":"IF('I spec'!K51=\"★\",\"★\",IF('I spec'!K51=\"◆\",\"◆\",\"\"))","v":""}]
[null,null,null,null,null,null,null,null,null,null,null,{"$f":"translation!E12","v":"Customer ："},null,null,null,null,null,null,{"$f":"translation!E13","v":"Pump Model ："},null,null,{"$f":"D14&E14&F14&G14&H14&I14&J14&K14&L14&M14&N14&O14&P14&Q14&R14","v":"K3VL80/B-1NRJM-P0/1-M*"},null,null,null,null,null,null,null,null,null,null,null,"BB ",{"$f":"translation!E122","v":" SAE-BB 2 bolt Through Drive, Side Ported"},null,null,null,null,null,null,null,null,null,{"$f":"IF('I spec'!K52=\"★\",\"★\",IF('I spec'!K52=\"◆\",\"◆\",\"\"))","v":""}]
{"$rows_left_out":39}
{"sheet":"I spec","index":3,"n_rows":105,"n_cols":12,"rows_kept":105,"cut":false,"hidden":true,"merged":[[89,2,104,2]]}
[]
["2. Pump Size",null,null,28,45,80,112,140,200,"200H",{"$f":"'K3VL-Industrial J'!T18","v":80}]
["Basic specifications","Pump Displacement Range",null,"28 cm3","45 - 16 cm3","80 - 35 cm3","112 - 56 cm3","140 - 70 cm3","200 - 100 cm3","200 - 100 cm3",{"$f":"HLOOKUP($K$2,TABA2[],ROW(K2),FALSE)","v":"80 - 35 cm3"}]
[null,"Max",null,28,45,80,112,140,200,200,{"$f":"HLOOKUP($K$2,TABA2[],ROW(K3),FALSE)","v":80}]
[null,"Min",null,28,16,35,56,70,100,100,{"$f":"HLOOKUP($K$2,TABA2[],ROW(K4),FALSE)","v":35}]
[null,"Max Speed",null,3600,3250,3000,2700,2500,1900,2200,{"$f":"HLOOKUP($K$2,TABA2[],ROW(K5),FALSE)","v":3000}]
[null,"Self Prime Speed",null,3000,2700,2400,2200,2200,1900,2200,{"$f":"HLOOKUP($K$2,TABA2[],ROW(K6),FALSE)","v":2400}]
[null,"Peak pressure",null,35,35,35,35,35,35,35,{"$f":"HLOOKUP($K$2,TABA2[],ROW(K7),FALSE)","v":35}]
[null,"Rated pressure",null,32,32,32,32,32,32,32,{"$f":"HLOOKUP($K$2,TABA2[],ROW(K8),FALSE)","v":32}]
["Mount","J","JIS Key & SAE Mount","-","2 bolt SAE-B","2 bolt SAE-C","4 bolt SAE-D","4 bolt SAE-D","-","-",{"$f":"HLOOKUP($K$2,TABA2[],ROW(K9),FALSE)","v":"2 bolt SAE-C"}]
{"$rows_left_out":96}
{"sheet":"translation","index":4,"n_rows":222,"n_cols":5,"rows_kept":222,"cut":false,"hidden":true,"merged":[]}
[null,"列1","列2","列3",{"$f":"'K3VL-Mobile'!V2","v":"Language : English"}]
[null,"言語 : 日本語","Language : English","語言 : 中文"]
[null,"K3VL シリーズ モバイル用 引合仕様書","K3VL series for Mobiles Inquiry Form","K3VL 系列 用于移动设备 询价规格书",{"$f":"HLOOKUP($E$1,TAB[],ROW(E2),FALSE)","v":"K3VL series for Mobiles Inquiry Form"}]
[null,"K3VL シリーズ 日本 産業機器用 引合仕様書","K3VL series for J Industrial Inquiry Form","K3VL 系列 日本工业设备 询价规格书",{"$f":"HLOOKUP($E$1,TAB[],ROW(E3),FALSE)","v":"K3VL series for J Industrial Inquiry Form"}]
[null,"赤枠のセルのドロップダウンリストからアイテムを選択してください。★付きのオプションは当社へ連絡ください、◆付きのオプションはヨーロッパまたはアメリカでのみ利用可能です。","Please select an item from a drop down list in a cell with thick red borders. Options with ★ is that please contact Kawasaki, options with ◆ is available in Europe/US.","请从红框单元格的下拉列表中选择项目。带★的选项请联系Kawasaki, 带◆的选项仅在欧洲或美国可使用。",{"$f":"HLOOKUP($E$1,TAB[],ROW(E4),FALSE)","v":"Please select an item from a drop down list in a cell with thick red borders. Options with ★ is that please contact Kawasaki, options with ◆ is available in Europe/US."}]
[null,"赤枠のセルのドロップダウンリストからアイテムを選択してください。★付きのオプションは当社へ連絡ください。","Please select an item from a drop down list in a cell with thick red borders. Options with ★ is that please contact Kawasaki.","请从红框单元格的下拉列表中选择项目。带★的选项请联系Kawasaki。",{"$f":"HLOOKUP($E$1,TAB[],ROW(E5),FALSE)","v":"Please select an item from a drop down list in a cell with thick red borders. Options with ★ is that please contact Kawasaki."}]
[null,"セルの色が赤の場合､当社標準仕様範囲外となります｡ 当社仕様範囲外の場合でも､備考に詳細を記載頂き､当社までご相談ください｡","If the cell's color is red, the request is out of Kawasaki standard specifications range. Even if the request is out of Kawasaki specification range, please describe the detail on the note and consult with Kawasaki.","如单元格颜色为红色时, 则超出本公司标准规格范围。即使是本公司规格范围外的情况, 也请在评论中详细记载, 并与本公司协商。",{"$f":"HLOOKUP($E$1,TAB[],ROW(E6),FALSE)","v":"If the cell's color is red, the request is out of Kawasaki standard specifications range. Even if the request is out of Kawasaki specification range, please describe the detail on the note and consult with Kawasaki."}]
[null,"記入日 ：","Fill-in Date ：","填写日期 ：",{"$f":"HLOOKUP($E$1,TAB[],ROW(E7),FALSE)","v":"Fill-in Date ："}]
[null,"作成者 ：","Author ：","编制者 ：",{"$f":"HLOOKUP($E$1,TAB[],ROW(E8),FALSE)","v":"Author ："}]
[null,"用途 ：","Application ：","用途 ：",{"$f":"HLOOKUP($E$1,TAB[],ROW(E9),FALSE)","v":"Application ："}]
{"$rows_left_out":213}
{"sheet":"history","index":5,"n_rows":41,"n_cols":7,"rows_kept":41,"cut":false,"hidden":true,"merged":[]}
[null,"Rev","Date","Who","Request / Correction","Answer","Memo"]
[null,"230811_rev1","23.08.10","S. Jolliffe","Differential Pressure: If a ΔP greater than 2.9MPa is entered, the KPMUK form updates the model code with the “C” heave duty spring option. Could this be coded similar to K3VLS. After selecting the reg, then select either of the below options:","Added adjastable range of C spring. To prevent selecting it without intention, do not add selectable regulator option. If you need the function, needs to update K3VL datasheet.","Update data sheet : Regulator option (C spring, by-pass pate, check valve, etc)"]
[null,"230811_rev1","23.08.10","S. Jolliffe","K3VL200 High Speed: Due to high pressure oil jet at speed above rated additional erosion occurs & the valve cover is updated to include a roll pin. A note was added to contact Kawasaki for review.","Added if 200 or 200H was chosen, a note is displayed at cell AQ7:AT10. To prevent selecting it without intention, I set that the uprated model can not be chosen on the sheet. If you need the function, needs to update K3VL datasheet.","Update data sheet : 200 & 200H uprated model"]
[null,"230811_rev1","23.08.10","S. Jolliffe","K3VL200 & /H High Pressure: Operating pressures up to 35MPa are permitted for this frame size. If torque limit, then standard bearing or if non-torque limiter the front bearing is up rated. A note should be added indicated a max pressure of 35MPa is permitted & to contact Kawasaki.","Added if 200 or 200H was chosen, a note is displayed at cell AQ7:AT10. To prevent selecting it without intention, I set that the uprated model can not be chosen on the sheet. If you need the function, needs to update K3VL datasheet.","Update data sheet : 200 & 200H uprated model"]
[null,"230811_rev1","23.08.10","S. Jolliffe","Why is the K3VL28 not included in the inquiry form? It is in the K3VL catalogue & the current K3VL inquiry form.","Added."]
[null,"230811_rev1","23.08.10","S. Jolliffe"," In the special suffix section, could “ATEX” be added to the drop down as KPMUK only. KPMUK does have a specific catalogue for ATEX options. Also all the electrical options would then need to be grey out. ","Added."]
[null,"230811_rev1","23.08.10","S. Jolliffe","Paint to be updated to include Beckers Grey (KPMUK only)","Added."]
[null,"230811_rev1","23.08.10","S. Jolliffe","On you sheet for the K3VL200/H , the minimum displacement range in cell AE8 is 200-200cc. Should this not be 200-100cc? ","Corrected."]
[null,"230811_rev1","23.08.10","S. Jolliffe","Should the special suffix drop down have a blank option to allow selection of standard product?","Added."]
[null,"230811_rev1","23.08.10","S. Jolliffe","Pressure cut-off range appears to be incorrect for all frame sizes.","Corrected."]
{"$rows_left_out":31}