{"text_format":"1","workbook":"xlsx","n_sheets":8,"sheets":["M7V-spec","M7VC-spec","M7X-spec","M7V","M7VC","M7X","Com","Notes"],"not_rendered":{"charts":0,"images":2,"macros":1,"external_links":0,"defined_names":87,"comments":1,"pivot_tables":0},"unopened":[],"bounds":{"document_bytes":16777216,"sheet_cells":100000,"rows_first":2000,"rows_last":500,"rows_between":2000,"halvings":0,"cell_chars":16384,"cell_head_chars":4096},"cells_cut":0,"cells_raw":0,"read":"whole","date_system":"1900"}

{"sheet":"M7V-spec","index":0,"n_rows":122,"n_cols":41,"rows_kept":122,"cut":false,"hidden":true,"merged":[[108,3,108,6],[108,14,108,15],[108,16,108,17],[108,18,108,19],[108,20,108,21],[119,20,119,21],[117,20,117,21],[118,14,118,15],[118,16,118,17],[118,18,118,19],[118,20,118,21],[111,20,111,21],[112,14,112,15],[112,16,112,17],[112,18,112,19],[112,20,112,21],[115,20,115,21],[116,20,116,21],[113,20,113,21],[114,20,114,21],[109,20,109,21],[110,14,110,15],[110,16,110,17],[110,18,110,19],[117,1,119,1],[117,3,119,6],[117,14,117,15],[117,16,117,17],[117,18,117,19],[119,14,119,15],[119,16,119,17],[119,18,119,19],[113,1,116,1],[113,3,116,6],[113,14,113,15],[113,16,113,17],[113,18,113,19],[115,14,115,15],[115,16,115,17],[115,18,115,19],[116,14,116,15],[116,16,116,17],[116,18,116,19],[114,14,114,15],[114,16,114,17],[114,18,114,19],[110,20,110,21],[109,1,112,1],[109,3,112,6],[109,14,109,15],[109,16,109,17],[109,18,109,19],[111,14,111,15],[111,16,111,17],[111,18,111,19],[106,18,106,19],[106,20,106,21],[107,14,107,15],[107,16,107,17],[107,18,107,19],[107,20,107,21],[105,1,105,13],[106,1,107,1],[106,3,107,6],[106,14,106,15],[106,16,106,17],[98,1,98,2],[103,14,103,21],[104,14,104,15],[104,16,104,17],[104,18,104,19],[104,20,104,21],[70,1,73,1],[70,3,73,7],[74,1,76,1],[74,3,76,7],[81,1,82,1],[81,3,82,7],[52,1,55,1],[63,1,64,1],[63,3,64,7],[66,1,69,1],[66,3,69,7],[29,10,29,11],[30,10,30,11],[31,10,31,11],[33,10,33,13],[46,1,49,1],[65,3,65,7],[22,6,22,7],[22,10,22,11],[27,1,27,2],[27,10,27,11],[28,10,28,11],[23,6,23,7],[23,10,23,11],[24,6,24,7],[24,10,24,11],[19,6,19,7],[19,10,19,11],[20,6,20,7],[20,10,20,11],[21,6,21,7],[21,10,21,11],[5,20,5,21],[6,20,6,21],[15,1,15,2],[18,6,18,7],[18,10,18,11]]}
[]
["M7V Ordering Code"]
[]
[]
[null,"Please fill in the Inquiry Form on page 39 in order to specify the requirement."]
[null,null,null,1,null,2,3,4,5,6,null,7,8,9,10,11,12,13,14,null,15]
[null,null,null,"M7V",null,112,"A","A",1,1,"-","A","A",1,"T1","X","X","X","N","-",1]
[null,null,null,null,null,null,null,null,null,null,null,null,null,null,null,null,null,null,null,null,null,null,null,null,null,null,null,null,null,null,null,null,null,null,null,null,null,null,null,{"$f":"IF(M7V!AG1=\"Language : English\",\"General(Other)\",\"一般(その他)\")","v":"General(Other)"}," "]
{"$rows_left_out":115}
{"sheet":"M7VC-spec","index":1,"n_rows":122,"n_cols":41,"rows_kept":122,"cut":false,"hidden":true,"merged":[[119,14,119,15],[119,16,119,17],[119,18,119,19],[119,20,119,21],[24,6,24,7],[24,10,24,11],[117,1,119,1],[117,3,119,6],[117,14,117,15],[117,16,117,17],[117,18,117,19],[117,20,117,21],[118,14,118,15],[118,16,118,17],[118,18,118,19],[118,20,118,21],[115,14,115,15],[115,16,115,17],[115,18,115,19],[115,20,115,21],[116,14,116,15],[116,16,116,17],[116,18,116,19],[116,20,116,21],[113,1,116,1],[113,3,116,6],[113,14,113,15],[113,16,113,17],[113,18,113,19],[113,20,113,21],[114,14,114,15],[114,16,114,17],[114,18,114,19],[114,20,114,21],[112,14,112,15],[112,16,112,17],[112,18,112,19],[112,20,112,21],[109,1,112,1],[109,3,112,6],[109,14,109,15],[109,16,109,17],[109,18,109,19],[109,20,109,21],[110,14,110,15],[110,16,110,17],[110,18,110,19],[110,20,110,21],[108,3,108,6],[108,14,108,15],[108,16,108,17],[108,18,108,19],[108,20,108,21],[111,14,111,15],[111,16,111,17],[111,18,111,19],[111,20,111,21],[105,1,105,13],[106,1,107,1],[106,3,107,6],[106,14,106,15],[106,16,106,17],[106,18,106,19],[98,1,98,2],[103,14,103,21],[104,14,104,15],[104,16,104,17],[104,18,104,19],[104,20,104,21],[106,20,106,21],[107,14,107,15],[107,16,107,17],[107,18,107,19],[107,20,107,21],[70,1,73,1],[70,3,73,7],[74,1,76,1],[74,3,76,7],[81,1,82,1],[81,3,82,7],[52,1,55,1],[63,1,64,1],[63,3,64,7],[65,3,65,7],[66,1,69,1],[66,3,69,7],[28,10,28,11],[29,10,29,11],[30,10,30,11],[31,10,31,11],[33,10,33,13],[46,1,49,1],[23,10,23,11],[27,1,27,2],[27,10,27,11],[20,6,20,7],[20,10,20,11],[21,10,21,11],[22,10,22,11],[19,6,19,7],[19,10,19,11],[5,20,5,21],[6,20,6,21],[15,1,15,2],[18,6,18,7],[18,10,18,11]]}
[]
["M7V Ordering Code"]
[]
[]
[null,"Please fill in the Inquiry Form on page 39 in order to specify the requirement."]
[null,null,null,1,null,2,3,4,5,6,null,7,8,9,10,11,12,13,14,null,15]
[null,null,null,"M7V",null,112,"A","A",1,1,"-","A","A",1,"T1","X","X","X","N","-",1]
[null,null,null,null,null,null,null,null,null,null,null,null,null,null,null,null,null,null,null,null,null,null,null,null,null,null,null,null,null,null,null,null,null,null,null,null,null,null,null,{"$f":"IF(M7VC!AG1=\"Language : English\",\"General(Other)\",\"一般(その他)\")","v":"General(Other)"}," "]
{"$rows_left_out":115}
{"sheet":"M7X-spec","index":2,"n_rows":81,"n_cols":41,"rows_kept":81,"cut":false,"hidden":true,"merged":[[16,2,16,3],[19,2,19,3],[28,2,28,3],[73,2,73,3]]}
[]
[null,"M7X Ordering Code"]
[]
[]
[null,null,"Please fill in the Inquiry Form on page ** in order to specify the requirement."]
[]
[null,null,"M7X",null,112,"A","A",2,2,"-","A","X","X","X","X","-","*"]
[null,null,1,null,2,3,4,5,6,null,7,8,9,10,11,null,12,null,null,null,null,null,null,null,null,null,null,null,null,null,null,null,null,null,null,null,null,null,null,{"$f":"IF(M7V!AG1=\"Language : English\",\"General(Other)\",\"一般(その他)\")","v":"General(Other)"}," "]
{"$rows_left_out":74}
{"sheet":"M7V","index":3,"n_rows":97,"n_cols":36,"rows_kept":97,"cut":false,"hidden":false,"merged":[[88,17,88,26],[89,7,89,11],[90,7,90,11],[91,7,91,11],[91,12,91,16],[90,12,90,16],[89,12,89,16],[89,17,89,26],[90,17,90,26],[91,17,91,26],[0,32,0,33],[38,7,38,28],[11,21,11,22],[20,29,20,30],[21,29,21,30],[22,29,22,35],[19,33,19,35],[38,29,38,30],[43,29,43,30],[38,31,38,35],[8,21,8,28],[5,17,5,20],[42,27,42,28],[5,21,5,24],[5,25,5,28],[0,17,0,28],[53,31,55,35],[65,31,65,35],[66,31,66,35],[46,8,46,17],[45,18,46,26],[45,7,46,7],[48,8,48,17],[47,7,48,7],[47,18,48,26],[45,27,46,28],[47,27,48,28],[44,29,52,30],[56,29,64,30],[60,7,60,26],[61,7,61,26],[62,7,62,26],[63,7,63,26],[64,7,64,26],[66,27,66,28],[64,27,64,28],[63,27,63,28],[58,7,58,26],[59,7,59,26],[65,27,65,28],[67,31,69,35],[65,29,65,30],[66,29,66,30],[90,31,91,35],[88,31,89,35],[67,29,69,30],[2,1,2,6],[5,1,6,14],[7,1,8,14],[63,31,64,35],[56,31,62,35],[86,31,87,35],[70,31,85,35],[2,32,2,35],[5,32,5,35],[8,32,8,35],[15,7,15,17],[15,18,15,28],[2,29,2,31],[5,29,5,31],[8,29,8,31],[2,17,2,20],[8,17,8,20],[2,21,2,28],[67,27,67,28],[68,27,68,28],[69,27,69,28],[86,7,86,26],[87,7,87,26],[81,13,81,26],[82,13,82,26],[83,13,83,26],[84,7,84,26],[93,31,94,35],[92,31,92,35],[74,27,74,28],[75,27,75,28],[81,27,81,28],[82,27,82,28],[94,27,94,28],[77,13,77,26],[78,13,78,26],[79,13,79,26],[84,29,87,30],[88,29,91,30],[92,29,94,30],[92,7,92,26],[70,29,83,30],[76,13,76,26],[90,27,90,28],[85,7,85,26],[80,13,80,26],[89,27,89,28],[81,8,83,12],[77,8,80,12],[88,12,88,16],[88,7,88,11],[56,5,64,6],[53,5,55,6],[44,5,52,6],[43,5,43,6],[39,5,42,6],[52,27,52,28],[51,27,51,28],[43,27,43,28],[62,27,62,28],[61,27,61,28],[49,27,49,28],[50,27,50,28],[56,7,56,26],[57,7,57,26],[57,27,57,28],[55,27,55,28],[54,18,54,26],[55,18,55,26],[95,29,95,30],[96,29,96,30],[14,7,14,28],[17,18,17,28],[18,18,18,28],[18,7,18,17],[19,18,19,28],[20,7,20,17],[20,18,20,28],[17,7,17,17],[83,27,83,28],[87,27,87,28],[84,27,84,28],[76,27,76,28],[77,27,77,28],[78,27,78,28],[79,27,79,28],[80,27,80,28],[59,27,59,28],[58,27,58,28],[56,27,56,28],[40,27,40,28],[41,27,41,28],[95,27,95,28],[22,5,22,6],[21,7,21,28],[22,7,22,28],[16,18,16,21],[16,22,16,28],[11,11,11,12],[11,13,11,14],[11,19,11,20],[16,7,16,10],[18,5,18,6],[17,5,17,6],[16,5,16,6],[15,5,15,6],[14,5,14,6],[16,11,16,17],[11,23,11,24],[11,27,11,28],[12,27,12,28],[11,15,11,16],[12,15,12,16],[21,5,21,6],[20,5,20,6],[19,5,19,6],[11,3,11,4],[12,3,12,4],[11,17,11,18],[27,34,27,35],[28,34,28,35],[12,5,12,6],[12,7,12,8],[12,9,12,10],[12,11,12,12],[12,13,12,14],[12,17,12,18],[12,19,12,20],[11,5,11,6],[11,7,11,8],[12,29,12,30],[11,29,11,30],[11,25,11,26],[12,25,12,26],[14,29,14,35],[15,29,15,30],[16,29,16,30],[17,29,17,30],[18,29,18,30],[19,29,19,30],[95,31,95,35],[96,31,96,35],[39,31,42,35],[50,8,50,17],[51,8,51,17],[52,8,52,17],[54,7,54,17],[55,7,55,17],[11,9,11,10],[44,31,52,35],[43,31,43,35],[60,27,60,28],[70,27,70,28],[71,27,71,28],[70,8,71,12],[70,7,71,7],[73,7,76,7],[72,27,72,28],[73,27,73,28],[72,8,72,12],[73,8,76,12],[44,7,44,17],[49,18,49,26],[39,29,42,30],[92,1,94,4],[95,1,95,4],[96,1,96,4],[14,1,14,4],[15,1,15,4],[38,1,38,4],[39,1,42,4],[43,1,43,4],[44,1,52,4],[53,1,55,4],[56,1,64,4],[65,1,65,4],[66,1,66,4],[22,1,22,4],[16,1,16,4],[17,1,17,4],[18,1,18,4],[19,1,19,4],[20,1,20,4],[21,1,21,4],[88,1,91,4],[32,1,36,19],[96,7,96,26],[84,1,87,4],[96,5,96,6],[95,5,95,6],[92,5,94,6],[88,5,91,6],[84,5,87,6],[70,5,83,6],[67,5,69,6],[66,5,66,6],[65,5,65,6],[96,27,96,28],[92,27,92,28],[85,27,85,28],[86,27,86,28],[93,7,93,26],[94,7,94,26],[93,27,93,28],[12,21,12,22],[67,7,67,26],[68,7,68,26],[69,7,69,26],[70,13,70,26],[39,7,39,26],[40,7,40,26],[41,7,41,26],[42,7,42,26],[43,7,43,26],[12,23,12,24],[95,7,95,26],[53,7,53,17],[53,18,53,28],[19,7,19,17],[54,27,54,28],[91,27,91,28],[67,1,69,4],[70,1,83,4],[11,1,12,1],[81,7,83,7],[77,7,80,7],[71,13,71,26],[72,13,72,26],[73,13,73,26],[74,13,74,26],[75,13,75,26],[31,20,31,35],[32,20,36,35],[23,33,23,34],[23,1,23,4],[24,1,24,4],[24,29,24,35],[24,7,24,28],[23,7,23,17],[23,18,23,28],[23,29,23,32],[29,29,29,35],[31,1,31,19],[53,29,55,30],[39,27,39,28],[24,5,24,6],[23,5,23,6],[26,5,26,6],[25,5,25,6],[38,5,38,6],[50,18,50,26],[51,18,51,26],[52,18,52,26],[44,18,44,28],[45,8,45,17],[47,8,47,17],[49,8,49,17],[29,1,29,4],[29,5,29,6],[29,7,29,28],[25,29,25,35],[26,29,26,35],[27,29,27,30],[28,29,28,30],[28,7,28,28],[25,7,25,28],[26,7,26,28],[27,7,27,28],[25,1,25,4],[26,1,26,4],[27,1,27,4],[28,1,28,4],[28,5,28,6],[27,5,27,6]]}
[null,null,null,null,null,null,null,null,null,null,null,null,null,null,null,null,null,{"$f":"VLOOKUP(M7V!V6,'M7V-spec'!AN8:AO12,2,0)","v":" "},null,null,null,null,null,null,null,null,null,null,null,null,null,null,"Language : English",null,null,"Rev: 4"]
[]
[null,"M7V series Inquiry Form",null,null,null,null,null,null,null,null,null,null,null,null,null,null,null,"Fill-in Date ：",null,null,null,null,null,null,null,null,null,null,null,"Author ："]
[]
[]
[null,"Please select an item from a drop down list in a cell with thick red borders. Options with ★ are under development. If it is chosen, the cell's color changes to yellow.",null,null,null,null,null,null,null,null,null,null,null,null,null,null,null,"Application ：",null,null,null,"General(Other)",null,null,null,null,null,null,null,"Machine Model ："]
[]
[null,"If the cell's color is red, the request is out of Kawasaki standard specification range. Even if the request is out of Kawasaki specification range, please describe the detail on the note and consult with Kawasaki."]
{"$rows_left_out":90}
{"sheet":"M7VC","index":4,"n_rows":97,"n_cols":36,"rows_kept":97,"cut":false,"hidden":false,"merged":[[96,1,96,4],[96,5,96,6],[96,7,96,26],[96,27,96,28],[96,29,96,30],[96,31,96,35],[95,1,95,4],[95,5,95,6],[95,7,95,26],[95,27,95,28],[95,29,95,30],[95,31,95,35],[92,31,92,35],[93,7,93,26],[93,27,93,28],[93,31,94,35],[94,7,94,26],[94,27,94,28],[90,31,91,35],[91,7,91,11],[91,12,91,16],[91,17,91,26],[91,27,91,28],[92,1,94,4],[92,5,94,6],[92,7,92,26],[92,27,92,28],[92,29,94,30],[89,7,89,11],[89,12,89,16],[89,17,89,26],[89,27,89,28],[90,7,90,11],[90,12,90,16],[90,17,90,26],[90,27,90,28],[80,27,80,28],[86,31,87,35],[87,7,87,26],[87,27,87,28],[88,1,91,4],[88,5,91,6],[88,7,88,11],[88,12,88,16],[88,17,88,26],[88,29,91,30],[88,31,89,35],[84,1,87,4],[84,5,87,6],[84,7,84,26],[84,27,84,28],[84,29,87,30],[85,7,85,26],[85,27,85,28],[86,7,86,26],[86,27,86,28],[70,31,85,35],[71,13,71,26],[71,27,71,28],[72,27,72,28],[67,31,69,35],[68,7,68,26],[68,27,68,28],[69,7,69,26],[69,27,69,28],[73,7,76,7],[73,8,76,12],[73,13,73,26],[73,27,73,28],[74,13,74,26],[74,27,74,28],[75,13,75,26],[75,27,75,28],[76,13,76,26],[76,27,76,28],[70,1,83,4],[70,5,83,6],[70,7,71,7],[70,8,71,12],[70,13,70,26],[66,1,66,4],[66,5,66,6],[77,7,80,7],[77,8,80,12],[72,8,72,12],[72,13,72,26],[80,13,80,26],[61,1,64,4],[61,5,64,6],[61,7,61,26],[61,27,61,28],[63,7,63,26],[63,27,63,28],[66,27,66,28],[66,29,66,30],[70,27,70,28],[70,29,83,30],[81,27,81,28],[82,13,82,26],[82,27,82,28],[83,13,83,26],[83,27,83,28],[77,13,77,26],[77,27,77,28],[78,13,78,26],[78,27,78,28],[79,13,79,26],[79,27,79,28],[81,7,83,7],[81,8,83,12],[81,13,81,26],[58,29,60,30],[58,31,60,35],[59,7,59,17],[59,18,59,26],[59,27,59,28],[60,7,60,17],[66,31,66,35],[67,1,69,4],[67,5,69,6],[67,7,67,26],[67,27,67,28],[67,29,69,30],[64,7,64,26],[64,27,64,28],[65,1,65,4],[65,5,65,6],[65,27,65,28],[65,29,65,30],[65,31,65,35],[61,29,64,30],[62,7,62,26],[62,27,62,28],[63,31,64,35],[61,31,62,35],[60,18,60,26],[60,27,60,28],[55,8,55,17],[55,18,55,26],[55,27,55,28],[56,8,56,17],[56,18,56,26],[56,27,56,28],[58,1,60,4],[58,5,60,6],[58,7,58,17],[58,18,58,28],[53,29,53,30],[53,31,53,35],[54,1,57,4],[54,5,57,6],[54,7,54,17],[54,18,54,28],[54,29,57,30],[54,31,57,35],[53,1,53,4],[53,5,53,6],[53,7,53,26],[53,27,53,28],[57,8,57,17],[57,18,57,26],[57,27,57,28],[52,1,52,4],[52,5,52,6],[52,7,52,26],[52,27,52,28],[52,29,52,30],[52,31,52,35],[31,1,31,19],[31,20,31,35],[32,1,49,19],[32,20,49,35],[51,1,51,4],[51,5,51,6],[51,7,51,28],[51,29,51,30],[51,31,51,35],[28,1,28,4],[28,5,28,6],[28,7,28,28],[28,29,28,30],[28,34,28,35],[29,1,29,4],[29,5,29,6],[29,7,29,28],[29,29,29,35],[26,1,26,4],[26,5,26,6],[26,7,26,28],[26,29,26,35],[27,1,27,4],[27,5,27,6],[27,7,27,28],[27,29,27,30],[27,34,27,35],[24,1,24,4],[24,5,24,6],[24,7,24,28],[24,29,24,35],[25,1,25,4],[25,5,25,6],[25,7,25,28],[25,29,25,35],[23,1,23,4],[23,5,23,6],[23,7,23,17],[23,18,23,28],[23,29,23,32],[23,33,23,34],[21,1,21,4],[21,5,21,6],[21,7,21,28],[21,29,21,30],[22,1,22,4],[22,5,22,6],[22,7,22,28],[22,29,22,35],[19,33,19,35],[20,1,20,4],[20,5,20,6],[20,7,20,17],[20,18,20,28],[20,29,20,30],[18,1,18,4],[18,5,18,6],[18,7,18,17],[18,18,18,28],[18,29,18,30],[19,1,19,4],[19,5,19,6],[19,7,19,17],[19,18,19,28],[19,29,19,30],[16,22,16,28],[16,29,16,30],[17,1,17,4],[17,5,17,6],[17,7,17,17],[17,18,17,28],[17,29,17,30],[15,1,15,4],[15,5,15,6],[15,7,15,17],[15,18,15,28],[15,29,15,30],[16,1,16,4],[16,5,16,6],[16,7,16,10],[16,11,16,17],[16,18,16,21],[11,19,11,20],[11,21,11,22],[12,27,12,28],[12,29,12,30],[14,1,14,4],[14,5,14,6],[14,7,14,28],[14,29,14,35],[12,15,12,16],[12,17,12,18],[12,19,12,20],[12,21,12,22],[12,23,12,24],[12,25,12,26],[7,1,8,14],[8,17,8,20],[8,21,8,28],[8,29,8,31],[8,32,8,35],[11,1,12,1],[11,3,11,4],[11,5,11,6],[11,7,11,8],[11,9,11,10],[11,23,11,24],[11,25,11,26],[11,27,11,28],[11,29,11,30],[12,3,12,4],[12,5,12,6],[12,7,12,8],[12,9,12,10],[12,11,12,12],[12,13,12,14],[11,11,11,12],[11,13,11,14],[11,15,11,16],[11,17,11,18],[5,1,6,14],[5,17,5,20],[5,21,5,24],[5,25,5,28],[5,29,5,31],[5,32,5,35],[0,17,0,28],[0,32,0,33],[2,1,2,6],[2,17,2,20],[2,21,2,28],[2,29,2,31],[2,32,2,35]]}
[null,null,null,null,null,null,null,null,null,null,null,null,null,null,null,null,null,{"$f":"VLOOKUP(M7VC!V6,'M7VC-spec'!AN8:AO12,2,0)","v":" "},null,null,null,null,null,null,null,null,null,null,null,null,null,null,"Language : English",null,null,"Rev: 4"]
[]
[null,"M7VC series Inquiry Form",null,null,null,null,null,null,null,null,null,null,null,null,null,null,null,"Fill-in Date ：",null,null,null,null,null,null,null,null,null,null,null,"Author ："]
[]
[]
[null,"Please select an item from a drop down list in a cell with thick red borders. Options with ★ are under development. If it is chosen, the cell's color changes to yellow.",null,null,null,null,null,null,null,null,null,null,null,null,null,null,null,"Application ：",null,null,null,"General(Other)",null,null,null,null,null,null,null,"Machine Model ："]
[]
[null,"If the cell's color is red, the request is out of Kawasaki standard specification range. Even if the request is out of Kawasaki specification range, please describe the detail on the note and consult with Kawasaki."]
{"$rows_left_out":90}
{"sheet":"M7X","index":5,"n_rows":96,"n_cols":36,"rows_kept":96,"cut":false,"hidden":false,"merged":[[2,1,2,6],[5,1,6,14],[7,1,8,14],[76,31,80,35],[81,31,82,35],[11,1,12,1],[11,3,11,4],[11,5,11,6],[11,7,11,8],[11,9,11,10],[11,11,11,12],[11,23,11,24],[12,19,12,20],[12,21,12,22],[12,25,12,26],[12,3,12,4],[12,5,12,6],[12,7,12,8],[12,9,12,10],[12,11,12,12],[27,34,27,35],[12,15,12,16],[16,31,16,34],[5,21,5,24],[5,25,5,28],[64,29,66,30],[8,32,8,35],[0,17,0,28],[8,29,8,31],[12,17,12,18],[0,32,0,33],[2,17,2,20],[2,21,2,28],[2,29,2,31],[2,32,2,35],[5,17,5,20],[5,29,5,31],[5,32,5,35],[8,17,8,20],[11,17,11,18],[11,19,11,20],[11,21,11,22],[11,25,11,26],[8,21,8,28],[12,23,12,24],[20,7,20,17],[20,18,20,28],[16,7,16,10],[11,13,11,14],[63,1,63,4],[11,15,11,16],[63,5,63,6],[63,7,63,28],[63,29,63,30],[63,31,63,35],[15,7,15,28],[12,13,12,14],[15,31,15,34],[14,1,14,4],[14,5,14,6],[14,7,14,28],[14,29,14,35],[15,1,15,4],[15,5,15,6],[15,29,15,30],[16,1,16,4],[16,5,16,6],[19,1,19,4],[19,5,19,6],[27,5,27,6],[31,1,31,19],[29,1,29,4],[16,11,16,28],[18,7,18,17],[18,18,18,28],[18,29,18,30],[16,29,16,30],[19,7,19,17],[19,18,19,28],[19,29,19,30],[20,29,20,30],[79,27,79,28],[80,7,80,26],[80,27,80,28],[74,7,74,17],[27,7,27,28],[27,29,27,30],[68,1,72,4],[68,5,72,6],[68,7,68,17],[68,18,68,28],[69,8,69,17],[69,18,69,26],[69,27,69,28],[70,8,70,17],[66,7,66,26],[66,27,66,28],[64,1,66,4],[64,5,66,6],[64,7,64,26],[64,27,64,28],[87,27,87,28],[85,27,85,28],[86,27,86,28],[85,7,85,17],[83,1,83,4],[83,5,83,6],[83,27,83,28],[83,29,83,30],[73,1,75,4],[73,5,75,6],[73,7,73,17],[73,18,73,28],[81,7,81,26],[81,27,81,28],[82,7,82,26],[82,27,82,28],[73,29,75,30],[76,7,76,26],[76,27,76,28],[77,7,77,26],[77,27,77,28],[78,7,78,26],[78,27,78,28],[79,7,79,26],[92,31,94,35],[93,7,93,26],[93,27,93,28],[94,7,94,26],[94,27,94,28],[92,1,94,4],[92,5,94,6],[92,7,92,26],[92,29,94,30],[92,27,92,28],[95,1,95,4],[95,5,95,6],[95,7,95,26],[95,27,95,28],[95,29,95,30],[95,31,95,35],[17,1,17,4],[17,5,17,6],[17,7,17,17],[17,18,17,28],[17,29,17,30],[19,33,19,35],[20,1,20,4],[20,5,20,6],[21,1,21,4],[21,5,21,6],[21,7,21,28],[21,29,21,30],[22,1,22,4],[22,5,22,6],[22,7,22,28],[22,29,22,35],[18,1,18,4],[18,5,18,6],[23,1,23,4],[23,5,23,6],[23,7,23,17],[23,18,23,28],[23,29,23,32],[23,33,23,34],[67,1,67,4],[67,5,67,6],[67,7,67,26],[67,27,67,28],[67,29,67,30],[67,31,67,35],[89,27,89,28],[90,27,90,28],[91,27,91,28],[76,1,82,4],[76,5,82,6],[76,29,82,30],[29,5,29,6],[29,7,29,28],[29,29,29,35],[71,8,71,17],[71,18,71,26],[71,27,71,28],[72,8,72,17],[72,18,72,26],[72,27,72,28],[84,1,87,4],[84,5,87,6],[84,7,84,17],[84,18,84,28],[85,18,85,26],[86,18,86,26],[87,18,87,26],[86,8,86,17],[87,8,87,17],[65,27,65,28],[31,20,31,35],[88,8,88,17],[89,1,91,4],[89,5,91,6],[28,1,28,4],[28,5,28,6],[24,1,24,4],[24,5,24,6],[24,7,24,28],[24,29,24,35],[25,1,25,4],[25,5,25,6],[25,7,25,28],[25,29,25,35],[32,1,61,19],[32,20,61,35],[26,1,26,4],[26,5,26,6],[26,7,26,28],[26,29,26,35],[27,1,27,4],[90,7,90,26],[91,7,91,26],[88,18,88,26],[88,27,88,28],[84,29,88,30],[84,31,88,35],[89,29,91,30],[28,7,28,28],[28,29,28,30],[28,34,28,35],[89,7,89,26],[83,31,83,35],[89,31,89,35],[90,31,91,35],[73,31,75,35],[74,18,74,24],[74,27,74,28],[75,7,75,17],[68,29,72,30],[68,31,72,35],[75,18,75,24],[75,27,75,28],[70,18,70,26],[70,27,70,28],[64,31,66,35],[65,7,65,26]]}
[null,null,null,null,null,null,null,null,null,null,null,null,null,null,null,null,null,{"$f":"VLOOKUP(M7X!V6,'M7X-spec'!AN8:AO12,2,0)","v":" "},null,null,null,null,null,null,null,null,null,null,null,null,null,null,"Language : English",null,null,"Rev: 4"]
[]
[null,"M7X series Inquiry Form",null,null,null,null,null,null,null,null,null,null,null,null,null,null,null,"Fill-in Date ：",null,null,null,null,null,null,null,null,null,null,null,"Author ："]
[]
[]
[null,"Please select an item from a drop down list in a cell with thick red borders. Options with ★ are under development. If it is chosen, the cell's color changes to yellow.",null,null,null,null,null,null,null,null,null,null,null,null,null,null,null,"Application ：",null,null,null,"General(Other)",null,null,null,null,null,null,null,"Machine Model ："]
[]
[null,"If the cell's color is red, the request is out of Kawasaki standard specification range. Even if the request is out of Kawasaki specification range, please describe the detail on the note and consult with Kawasaki."]
{"$rows_left_out":89}
{"sheet":"Com","index":6,"n_rows":216,"n_cols":26,"rows_kept":216,"cut":false,"hidden":true,"merged":[]}
[null,"A",1,1,"A11","○",null,"A",1,1,"A11","○",null,"T1","X","T1X","○",null,"T1X",1,null,"C",1,2,"C12","○"]
[null,"A",1,2,"A12","○",null,"A",1,2,"A12","○",null,"T2","X","T2X","○",null,"T2X",1,null,"C",1,3,"C13","○"]
["SAE","A",1,3,"A13","○",null,"A",1,3,"A13","○",null,"Y1","X","Y1X","○",null,"Y1X",2,null,"C",1,7,"C17","×"]
["ISO","A",1,4,"A14","×",null,"A",1,4,"A14","×",null,"E1","X","E1X","○",null,"E1X",3,null,"C",1,8,"C18","×"]
[null,"A",1,5,"A15","×",null,"A",1,5,"A15","×",null,"E2","X","E2X","○",null,"E3X",3,null,"C",4,2,"C42","×"]
[null,"A",1,6,"A16","×",null,"A",1,6,"A16","×",null,"E3","X","E3X","○",null,"E2X",4,null,"C",4,3,"C43","×"]
[null,"A",1,7,"A17","×",null,"A",1,7,"A17","×",null,"E4","X","E4X","○",null,"E4X",4,null,"C",4,7,"C47","○"]
[null,"A",1,8,"A18","×",null,"A",1,8,"A18","×",null,"P1","X","P1X","○",null,"E1A1",5,null,"C",4,8,"C48","○"]
{"$rows_left_out":209}
{"sheet":"Notes","index":7,"n_rows":13,"n_cols":1,"rows_kept":13,"cut":false,"hidden":true,"merged":[]}
["Notes:"]
[]
["1)  Select an option from the drop down list from top-to-bottom, beginning with the motor size."]
[]
["2)   A requirement displayed with gray shading means that it is not available."]
[]
["3)   A requirement which is under development is marked with  a star \"★\" on the right."]
[]
{"$rows_left_out":5}